{"text_format":"3","workbook":"xlsx","n_sheets":16,"sheets":["Output","Input","Considerations","Sortie","Entrée","Considérations","Raw Data","Notes","List","LTCGE","LTCGE French","List French","RRIF","RRIF French","Estate tax rates","Estate tax rates French"],"not_rendered":{"charts":2,"images":12,"macros":1,"defined_names":302,"comments":2},"read":"whole","date_system":"1900"}

{"sheet":"Output","index":0,"n_rows":30,"n_cols":17,"rows_kept":30,"hidden":true,"merged":[[11,1,11,16],[15,1,15,16],[16,3,16,6],[17,3,18,6],[17,10,18,15],[19,10,20,15],[21,3,21,6],[21,10,22,15],[22,3,23,6],[27,1,27,16],[28,1,28,16],[29,1,29,16]]}
{"$rows_empty":9}
[{"$nulls":16},"v2024"]
[]
[null,"You’ve worked your whole life to build your wealth and would like your loved ones to continue enjoying the fruits of your hard work. However, there are taxes and expenses that must be paid in cash before your assets are transferred to your beneficiaries. Those taxes and expenses may be higher than you think and may significantly reduce the size of your estate available to your beneficiaries. Further, if your estate does not have enough liquid assets to pay off those expenses some of the other assets may have to be quickly sold for example: your home, cottage or vehicles."]
[null,"The following chart is an estimation of what could happen to your estate and the cash shortfall you will leave behind."]
[]
[]
[null,"Taxes and final expenses may shrink the estate you intend to leave behind for your beneficiary."]
{"$rows_left_out":15}
{"sheet":"Input","index":1,"n_rows":144,"n_cols":68,"rows_kept":144,"hidden":true,"merged":[[7,7,7,29],[8,11,8,12],[10,22,10,50],[14,2,14,72],[15,2,15,72],[16,2,16,72],[17,2,17,72],[18,2,18,72],[23,2,23,72],[24,2,24,72],[25,2,25,72],[27,3,27,7],[27,8,27,26],[27,27,27,31],[27,32,27,33],[27,35,27,41],[27,42,27,43],[27,45,27,54],[27,55,27,56],[27,58,27,65],[27,66,27,70],[33,2,33,72],[34,2,34,72],[35,2,35,72],[37,25,37,30],[37,32,37,36],[37,38,37,42],[37,44,37,48],[37,50,37,53],[37,55,37,59],[37,61,37,65],[37,67,37,71],[39,55,39,59],[39,61,39,65],[39,67,39,71],[41,3,41,6],[41,27,41,28],[41,38,41,42],[41,44,41,48],[41,50,41,53],[41,55,41,59],[41,61,41,65],[41,67,41,71],[43,3,43,6],[43,27,43,28],[43,44,43,48],[43,50,43,53],[43,55,43,59],[43,61,43,65],[43,67,43,71],[45,27,45,28],[45,38,45,42],[45,44,45,48],[45,50,45,53],[45,55,45,59],[45,61,45,65],[45,67,45,71],[47,3,47,26],[47,27,47,28],[47,32,47,36],[47,38,47,42],[47,44,47,48],[47,50,47,53],[47,55,47,59],[47,61,47,65],[47,67,47,71],[49,3,49,26],[49,27,49,28],[49,32,49,36],[49,38,49,42],[49,44,49,48],[49,50,49,53],[49,55,49,59],[49,61,49,65],[49,67,49,71],[51,27,51,28],[51,32,51,36],[51,38,51,42],[51,44,51,48],[51,50,51,53],[51,55,51,59],[51,61,51,65],[51,67,51,71],[53,32,53,36],[53,44,53,48],[53,50,53,53],[53,55,53,59],[53,61,53,65],[53,67,53,71],[55,32,55,36],[55,44,55,48],[55,50,55,53],[55,55,55,59],[55,61,55,65],[55,67,55,71],[57,32,57,36],[57,44,57,48],[57,50,57,53],[57,55,57,59],[57,61,57,65],[57,67,57,71],[59,27,59,28],[59,32,59,36],[59,44,59,48],[59,50,59,53],[59,55,59,59],[59,61,59,65],[59,67,59,71],[61,27,61,28],[61,32,61,36],[61,44,61,48],[61,55,61,59],[61,61,61,65],[61,67,61,71],[63,32,63,36],[63,44,63,48],[63,50,63,53],[63,55,63,59],[63,61,63,65],[63,67,63,71],[65,61,65,65],[65,67,65,71],[67,61,67,65],[67,67,67,71],[69,32,69,36],[69,38,69,42],[69,44,69,48],[69,50,69,53],[69,55,69,59],[69,61,69,65],[69,67,69,71],[71,32,71,36],[71,38,71,42],[71,44,71,48],[71,50,71,53],[71,55,71,59],[71,61,71,65],[71,67,71,71],[73,55,73,59],[73,61,73,65],[73,67,73,71],[75,55,75,59],[75,61,75,65],[75,67,75,71],[78,55,78,60],[78,61,78,65],[78,67,78,71],[84,2,84,72],[85,2,85,72],[86,2,86,72],[88,61,88,65],[88,67,88,71],[90,61,90,65],[90,67,90,71],[92,32,92,36],[92,61,92,65],[94,32,95,36],[94,61,95,65],[97,61,97,65],[100,55,100,60],[100,61,100,65],[100,67,100,71],[106,2,106,72],[107,2,107,72],[108,2,108,72],[110,3,110,9],[110,10,110,15],[110,17,110,27],[110,28,110,33],[110,35,110,44],[110,45,110,50],[110,56,110,65],[110,66,110,71],[116,2,116,25],[117,2,117,25],[118,2,118,25],[120,15,120,18],[120,20,120,24],[122,20,122,24],[124,20,124,24],[126,15,126,18],[126,20,126,24],[128,15,128,18],[128,20,128,24],[130,15,130,18],[130,20,130,24],[132,20,132,24],[134,20,134,24],[136,20,136,24],[139,3,139,19],[139,20,139,24],[143,2,143,72]]}
{"$rows_empty":7}
[null,null,"Prepared by:",{"$nulls":4},"Smith Advisors"]
[null,null,"Include in printouts:",{"$nulls":8},"No"]
[]
[{"$nulls":22},"ESTATE TRANSFER ESTIMATE v2024"]
[]
[]
[]
{"$rows_left_out":131}
{"sheet":"Considerations","index":2,"n_rows":46,"n_cols":4,"rows_kept":46,"hidden":true,"merged":[[14,2,14,76],[15,2,15,76],[16,2,16,76],[18,3,18,76],[19,3,19,76],[20,3,20,76],[21,3,21,76],[22,3,22,76],[23,3,23,76],[24,3,24,76],[30,2,30,76],[31,2,31,76],[32,2,32,76],[34,3,34,76],[35,3,35,76],[36,3,36,76],[37,3,37,76],[38,3,38,76],[39,3,39,76],[40,3,40,76],[41,3,41,76],[42,3,42,76],[43,3,43,76],[44,3,44,76],[45,3,45,76]]}
{"$rows_empty":15}
[null,null,"General considerations"]
[]
[]
[null,null,1,"RBC Life Insurance Company recommends consulting with your legal, accounting, tax and financial advisors before making any decision. The information provided in this presentation is not intended to be relied upon as tax, legal, accounting or financial advice."]
[null,null,2,"RBC Life Insurance Company does not accept any liability for any direct, indirect or consequential loss arising from, or in connection with, the information in this presentation."]
[null,null,3,"Reasonable care has been taken to ensure the accuracy of the calculations and information provided, but errors and omissions are possible."]
[null,null,4,"If an insurance policy is issued, the coverage will be governed by the terms of the policy. This presentation will not form part of any policy issued."]
{"$rows_left_out":25}
{"sheet":"Sortie","index":3,"n_rows":29,"n_cols":17,"rows_kept":29,"merged":[[11,1,11,16],[15,1,15,16],[16,3,16,6],[17,3,18,6],[17,10,18,15],[19,10,20,15],[21,3,21,6],[21,10,22,15],[22,3,23,6],[26,1,26,16],[27,1,27,16],[28,1,28,16]]}
[]
[]
[]
[null,"Quel patrimoine laissez-vous réellement ?"]
[]
[]
[]
[]
{"$rows_left_out":22}
{"sheet":"Entrée","index":4,"n_rows":144,"n_cols":72,"rows_kept":144,"merged":[[7,7,7,29],[8,15,8,16],[10,22,10,54],[14,2,14,76],[15,2,15,76],[16,2,16,76],[17,2,17,76],[18,2,18,76],[23,2,23,76],[24,2,24,76],[25,2,25,76],[27,8,27,24],[27,32,27,33],[27,43,27,44],[27,56,27,57],[27,70,27,74],[33,2,33,76],[34,2,34,76],[35,2,35,76],[37,28,37,33],[37,35,37,39],[37,41,37,45],[37,47,37,51],[37,53,37,57],[37,59,37,63],[37,65,37,69],[37,71,37,75],[39,59,39,63],[39,65,39,69],[39,71,39,75],[41,3,41,6],[41,30,41,31],[41,41,41,45],[41,47,41,51],[41,53,41,57],[41,59,41,63],[41,65,41,69],[41,71,41,75],[43,3,43,6],[43,30,43,31],[43,47,43,51],[43,53,43,57],[43,59,43,63],[43,65,43,69],[43,71,43,75],[45,30,45,31],[45,41,45,45],[45,47,45,51],[45,53,45,57],[45,59,45,63],[45,65,45,69],[45,71,45,75],[47,3,47,29],[47,30,47,31],[47,35,47,39],[47,41,47,45],[47,47,47,51],[47,53,47,57],[47,59,47,63],[47,65,47,69],[47,71,47,75],[49,3,49,29],[49,30,49,31],[49,35,49,39],[49,41,49,45],[49,47,49,51],[49,53,49,57],[49,59,49,63],[49,65,49,69],[49,71,49,75],[51,30,51,31],[51,35,51,39],[51,41,51,45],[51,47,51,51],[51,53,51,57],[51,59,51,63],[51,65,51,69],[51,71,51,75],[53,35,53,39],[53,47,53,51],[53,53,53,57],[53,59,53,63],[53,65,53,69],[53,71,53,75],[55,35,55,39],[55,47,55,51],[55,53,55,57],[55,59,55,63],[55,65,55,69],[55,71,55,75],[57,3,58,34],[57,35,57,39],[57,47,57,51],[57,53,57,57],[57,59,57,63],[57,65,57,69],[57,71,57,75],[59,30,59,31],[59,35,59,39],[59,47,59,51],[59,53,59,57],[59,59,59,63],[59,65,59,69],[59,71,59,75],[61,30,61,31],[61,35,61,39],[61,47,61,51],[61,59,61,63],[61,65,61,69],[61,71,61,75],[63,3,64,34],[63,35,63,39],[63,47,63,51],[63,53,63,57],[63,59,63,63],[63,65,63,69],[63,71,63,75],[65,65,65,69],[65,71,65,75],[67,65,67,69],[67,71,67,75],[69,35,69,39],[69,41,69,45],[69,47,69,51],[69,53,69,57],[69,59,69,63],[69,65,69,69],[69,71,69,75],[71,35,71,39],[71,41,71,45],[71,47,71,51],[71,53,71,57],[71,59,71,63],[71,65,71,69],[71,71,71,75],[73,59,73,63],[73,65,73,69],[73,71,73,75],[75,59,75,63],[75,65,75,69],[75,71,75,75],[78,59,78,64],[78,65,78,69],[78,71,78,75],[84,2,84,76],[85,2,85,76],[86,2,86,76],[88,65,88,69],[88,71,88,75],[90,65,90,69],[90,71,90,75],[92,47,92,51],[92,65,92,69],[94,47,95,51],[94,65,95,69],[97,65,97,69],[100,59,100,64],[100,65,100,69],[100,71,100,75],[106,2,106,76],[107,2,107,76],[108,2,108,76],[110,3,110,9],[110,10,110,15],[110,17,110,34],[110,35,110,40],[110,42,110,53],[110,54,110,59],[110,61,110,69],[110,70,110,75],[116,2,116,28],[117,2,117,28],[118,2,118,28],[120,15,121,18],[120,20,120,27],[122,20,122,27],[124,20,124,27],[126,15,126,18],[126,20,126,27],[128,15,128,18],[128,20,128,27],[130,15,130,18],[130,20,130,27],[132,20,132,27],[134,20,134,27],[136,20,136,27],[139,3,139,19],[139,20,139,27],[143,2,143,76]]}
{"$rows_empty":7}
[null,null,"Préparé par:",{"$nulls":4},"Smith Advisors"]
[null,null," Inclure dans les impressions:",{"$nulls":12},"Non"]
[]
[{"$nulls":22},"ESTIMATION DU TRANSFERT DE PATRIMOINE, version 2024"]
[]
[]
[]
{"$rows_left_out":131}
{"sheet":"Considérations","index":5,"n_rows":46,"n_cols":4,"rows_kept":46,"merged":[[14,2,14,76],[15,2,15,76],[16,2,16,76],[18,3,18,76],[19,3,19,76],[20,3,20,76],[21,3,21,76],[22,3,22,76],[23,3,23,76],[24,3,24,76],[30,2,30,76],[31,2,31,76],[32,2,32,76],[34,3,34,76],[35,3,35,76],[36,3,36,76],[37,3,37,76],[38,3,38,76],[39,3,39,76],[40,3,40,76],[41,3,41,76],[42,3,42,76],[43,3,43,76],[44,3,44,76],[45,3,45,76]]}
{"$rows_empty":15}
[null,null,"Considérations d’ordre général"]
[]
[]
[null,null,1,"La Compagnie d’assurance vie RBC recommande de consulter vos conseillers juridiques, comptables, fiscaux et financiers avant de prendre une décision. Les renseignements contenus dans cette présentation ne devraient pas être interprétés comme des conseils d’ordre fiscal, juridique, comptable ou financier."]
[null,null,2,"La Compagnie d’assurance vie RBC n’accepte aucune responsabilité pour toute perte directe, indirecte ou consécutive découlant des renseignements dans cette présentation."]
[null,null,3,"Des précautions raisonnables ont été prises pour garantir l’exactitude des calculs et des renseignements fournis, mais des erreurs et des omissions sont possibles."]
[null,null,4,"Si une police d’assurance est établie, la couverture sera régie par les conditions de la police. Cette présentation ne fait pas partie d’une police établie."]
{"$rows_left_out":25}
{"sheet":"Raw Data","index":6,"n_rows":39,"n_cols":9,"rows_kept":39,"hidden":true}
[]
[null,"French"]
[{"$nulls":6},"M"]
[null,"Your beneficiary likely gets",{"$f":"C19","v":{"v":1587175.632591296,"d":"$1.6 M"}},null,null,"Liquid",{"$f":"Input!K111","v":{"v":209025.93314950223,"d":"209,026 "}},{"$f":"G4","v":{"v":209025.93314950223,"d":"$0.2 M"}},{"$f":"IF($B$2=\"French\",SUBSTITUTE(TEXT(H4/100000,\"# ##0.0\"),\".\",\",\")&\" M$\",H4)","v":" 2,1 M$"}]
[null,"Your estate pays in taxes etc.",{"$f":"C20","v":{"v":821850.3005582063,"d":"$0.8 M"}},null,null,"Non-Liquid",{"$f":"C7-G4","v":{"v":2200000,"d":"2,200,000"}},{"$f":"G5","v":{"v":2200000,"d":"$2.2 M"}},{"$f":"IF($B$2=\"French\",SUBSTITUTE(TEXT(H5/100000,\"# ##0.0\"),\".\",\",\")&\" M$\",H5)","v":" 22,0 M$"}]
[]
[null,null,{"$f":"Input!$BP$79","v":{"v":2409025.933149502,"d":"2,409,026"}}]
[]
{"$rows_left_out":26}
{"sheet":"Notes","index":7,"n_rows":44,"n_cols":2,"rows_kept":44,"hidden":true}
[]
["Nehal"]
["Done","1. The text in the “about this calculator should be changed as under:"]
[null,"The purpose of this calculator is to estimate the income tax and estate tax that may become payable upon your death based on the assets you may own at that time and show its impact on your estate. The calculation assumes that you are either single or last to die spouse/common law-partner."]
["Done","2. The width of client information section should be expanded to match the size of other sections. May be client name, age and comparison age would appear in one row, and the province and marginal tax rate would appear in next row."]
[null,"3. If possible design the calculator such that if the client’s current age is 72 or higher, the RRSP row does not appear."]
["Will see what I can do during the coding part of this calculator. Might be able to hide the RRSP row altogether when the age is high enough."]
["Done","4. The formulas in “data entry” tab of the excel file Is end may be directly included in this input tab. The we will not need data entry tab."]
{"$rows_left_out":37}
{"sheet":"List","index":8,"n_rows":72,"n_cols":4,"rows_kept":72,"hidden":true}
["Capital gains inclusion factor",{"v":0.5,"d":"50.00%"}]
[]
["Province","Estate tax"]
[]
["AB",{"$f":"+'Estate tax rates'!H7","v":{"v":525,"d":"525.00"}},"Alberta",{"$f":"B5","v":{"v":525,"d":"525.00"}}]
["BC",{"$f":"+'Estate tax rates'!H12","v":{"v":33390,"d":"33,390.00"}},"British Columbia",{"$f":"B6","v":{"v":33390,"d":"33,390.00"}}]
["MB",{"$f":"+'Estate tax rates'!H15","v":0},"Manitoba",0]
["NB",{"$f":"+'Estate tax rates'!H22","v":{"v":12050,"d":"12,050.00"}},"New Brunswick",{"v":12050,"d":"12,050.00"}]
{"$rows_left_out":65}
{"sheet":"LTCGE","index":9,"n_rows":101,"n_cols":9,"rows_kept":101,"hidden":true}
["Year","Age","LTCGE limit","LTCGD limit",null,"Inflation factor",{"v":0.03,"d":"3%"},{"$f":"SUBSTITUTE(TEXT(G1*10,\"0.0%\"),\".\",\",\")","v":"30,0%"}]
[{"$f":"YEAR(NOW())","v":2024},{"$f":"Input!$AG$28","v":68},{"$f":"VLOOKUP(A2,$H$3:$I$4,2,FALSE)","v":{"v":1016836,"d":"1,016,836.00"}},{"$f":"+C2*50%","v":{"v":508418,"d":"508,418.00"}},{"$nulls":4},"Actual LTCGE"]
[{"$f":"+A2+1","v":2025},{"$f":"+B2+1","v":69},{"$f":"IF(ISNA(VLOOKUP(A3,$H$3:$I$4,2,FALSE)),C2*(1+$G$1),VLOOKUP(A3,$H$3:$I$4,2,FALSE))","v":{"v":1047341.0800000001,"d":"1,047,341.08"}},{"$f":"+C3*50%","v":{"v":523670.54000000004,"d":"523,670.54"}},{"$nulls":3},2023,{"v":971190,"d":"971,190.00"}]
[{"$f":"+A3+1","v":2026},{"$f":"+B3+1","v":70},{"$f":"IF(ISNA(VLOOKUP(A4,$H$3:$I$4,2,FALSE)),C3*(1+$G$1),VLOOKUP(A4,$H$3:$I$4,2,FALSE))","v":{"v":1078761.3124000002,"d":"1,078,761.31"}},{"v":539380.6562000001,"d":"539,380.66"},{"$nulls":3},2024,{"v":1016836,"d":"1,016,836.00"}]
[2027,71,{"v":1111124.1517720001,"d":"1,111,124.15"},{"v":555562.0758860001,"d":"555,562.08"}]
[2028,72,{"v":1144457.8763251603,"d":"1,144,457.88"},{"v":572228.9381625801,"d":"572,228.94"}]
[2029,73,{"v":1178791.612614915,"d":"1,178,791.61"},{"v":589395.8063074575,"d":"589,395.81"}]
[2030,74,{"v":1214155.3609933625,"d":"1,214,155.36"},{"v":607077.6804966812,"d":"607,077.68"}]
{"$rows_left_out":94}
{"sheet":"LTCGE French","index":10,"n_rows":101,"n_cols":7,"rows_kept":101,"hidden":true}
["Year","Age","LTCGE limit","LTCGD limit",null,"Inflation factor",{"$f":"LTCGE!G1","v":{"v":0.03,"d":"3%"}}]
[{"$f":"YEAR(NOW())","v":2024},{"$f":"Entrée!$AG$28","v":68},{"$f":"VLOOKUP(A2,LTCGE!$H$3:$I$4,2,FALSE)","v":{"v":1016836,"d":"1,016,836.00"}},{"$f":"+C2*50%","v":{"v":508418,"d":"508,418.00"}}]
[{"$f":"+A2+1","v":2025},{"$f":"+B2+1","v":69},{"$f":"IF(ISNA(VLOOKUP(A3,LTCGE!$H$3:$I$4,2,FALSE)),C2*(1+$G$1),VLOOKUP(A3,LTCGE!$H$3:$I$4,2,FALSE))","v":{"v":1047341.0800000001,"d":"1,047,341.08"}},{"$f":"+C3*50%","v":{"v":523670.54000000004,"d":"523,670.54"}}]
[{"$f":"+A3+1","v":2026},70,{"$f":"IF(ISNA(VLOOKUP(A4,LTCGE!$H$3:$I$4,2,FALSE)),C3*(1+$G$1),VLOOKUP(A4,LTCGE!$H$3:$I$4,2,FALSE))","v":{"v":1078761.3124000002,"d":"1,078,761.31"}},{"v":539380.6562000001,"d":"539,380.66"}]
[2027,71,{"$f":"IF(ISNA(VLOOKUP(A5,LTCGE!$H$3:$I$4,2,FALSE)),C4*(1+$G$1),VLOOKUP(A5,LTCGE!$H$3:$I$4,2,FALSE))","v":{"v":1111124.1517720001,"d":"1,111,124.15"}},{"v":555562.0758860001,"d":"555,562.08"}]
[2028,72,{"$f":"IF(ISNA(VLOOKUP(A6,LTCGE!$H$3:$I$4,2,FALSE)),C5*(1+$G$1),VLOOKUP(A6,LTCGE!$H$3:$I$4,2,FALSE))","v":{"v":1144457.8763251603,"d":"1,144,457.88"}},{"v":572228.9381625801,"d":"572,228.94"}]
[2029,73,{"$f":"IF(ISNA(VLOOKUP(A7,LTCGE!$H$3:$I$4,2,FALSE)),C6*(1+$G$1),VLOOKUP(A7,LTCGE!$H$3:$I$4,2,FALSE))","v":{"v":1178791.612614915,"d":"1,178,791.61"}},{"v":589395.8063074575,"d":"589,395.81"}]
[2030,74,{"$f":"IF(ISNA(VLOOKUP(A8,LTCGE!$H$3:$I$4,2,FALSE)),C7*(1+$G$1),VLOOKUP(A8,LTCGE!$H$3:$I$4,2,FALSE))","v":{"v":1214155.3609933625,"d":"1,214,155.36"}},{"v":607077.6804966812,"d":"607,077.68"}]
{"$rows_left_out":94}
{"sheet":"List French","index":11,"n_rows":72,"n_cols":4,"rows_kept":72,"hidden":true}
["Capital gains inclusion factor",{"v":0.5,"d":"50.00%"}]
[]
["Province","Estate tax"]
[]
["AB",{"$f":"+'Estate tax rates French'!H7","v":{"v":525,"d":"525.00"}},"Alberta",{"$f":"B5","v":{"v":525,"d":"525.00"}}]
["BC",{"$f":"+'Estate tax rates French'!H12","v":{"v":33390,"d":"33,390.00"}},"British Columbia",{"$f":"B6","v":{"v":33390,"d":"33,390.00"}}]
["MB",{"$f":"+'Estate tax rates French'!H15","v":0},"Manitoba",0]
["NB",{"$f":"+'Estate tax rates French'!H22","v":{"v":12050,"d":"12,050.00"}},"New Brunswick",{"v":12050,"d":"12,050.00"}]
{"$rows_left_out":65}
{"sheet":"RRIF","index":12,"n_rows":43,"n_cols":6,"rows_kept":43,"hidden":true}
[]
["Age on January 1st","RRIF factor","Value on January 1st","Minimum withdrawal","Annual growth","Cl.bal."]
[]
[71,0.0528,{"$f":"+IF(Input!$AG$28<72,+FV(Input!$AY$42,71-Input!$AG$28,-Input!AM42,-Input!AS42,1),0)","v":{"v":578664.3200000001,"d":"578,664"}},{"$f":"+C4*B4","v":{"v":30553.476096000002,"d":"30,553"}},{"$f":"+(C4-D4)*Input!$AY$44","v":0},{"$f":"+C4-D4+E4","v":{"v":548110.843904,"d":"548,111"}}]
[{"$f":"+A4+1","v":72},{"v":0.054,"d":"0.0540"},{"$f":"+IF(Input!$AG$28=RRIF!A5,Input!$AS$44,0)+F4","v":{"v":548110.843904,"d":"548,111"}},{"$f":"+C5*B5","v":{"v":29597.985570816,"d":"29,598"}},{"$f":"+(C5-D5)*Input!$AY$44","v":0},{"$f":"+C5-D5+E5","v":{"v":518512.85833318403,"d":"518,513"}}]
[{"$f":"+A5+1","v":73},0.0553,{"$f":"+IF(Input!$AG$28=RRIF!A6,Input!$AS$44,0)+F5","v":{"v":518512.85833318403,"d":"518,513"}},{"v":28673.761065825078,"d":"28,674"},{"$f":"+(C6-D6)*Input!$AY$44","v":0},{"$f":"+C6-D6","v":{"v":489839.097267359,"d":"489,839"}}]
[74,0.0567,{"$f":"+IF(Input!$AG$28=RRIF!A7,Input!$AS$44,0)+F6","v":{"v":489839.097267359,"d":"489,839"}},{"v":27773.876815059255,"d":"27,774"},{"$f":"+(C7-D7)*Input!$AY$44","v":0},{"v":462065.2204522997,"d":"462,065"}]
[75,0.0582,{"$f":"+IF(Input!$AG$28=RRIF!A8,Input!$AS$44,0)+F7","v":{"v":462065.2204522997,"d":"462,065"}},{"v":26892.195830323843,"d":"26,892"},{"$f":"+(C8-D8)*Input!$AY$44","v":0},{"v":435173.02462197584,"d":"435,173"}]
{"$rows_left_out":36}
{"sheet":"RRIF French","index":13,"n_rows":43,"n_cols":6,"rows_kept":43,"hidden":true}
[]
["Age on January 1st","RRIF factor","Value on January 1st","Minimum withdrawal","Annual growth","Cl.bal."]
[]
[71,0.0528,{"$f":"+IF(Entrée!$AG$28<72,+FV(Entrée!$BB$42,71-Entrée!$AG$28,-Entrée!AP42,-Entrée!AV42,1),0)","v":{"v":578664.3200000001,"d":"578,664"}},{"$f":"+C4*B4","v":{"v":30553.476096000002,"d":"30,553"}},{"$f":"+(C4-D4)*Entrée!$BB$44","v":0},{"$f":"+C4-D4+E4","v":{"v":548110.843904,"d":"548,111"}}]
[{"$f":"+A4+1","v":72},{"v":0.054,"d":"0.0540"},{"$f":"+IF(Entrée!$AG$28='RRIF French'!A5,Entrée!$AV$44,0)+F4","v":{"v":548110.843904,"d":"548,111"}},{"$f":"+C5*B5","v":{"v":29597.985570816,"d":"29,598"}},{"$f":"+(C5-D5)*Entrée!$BB$44","v":0},{"$f":"+C5-D5+E5","v":{"v":518512.85833318403,"d":"518,513"}}]
[{"$f":"+A5+1","v":73},0.0553,{"$f":"+IF(Entrée!$AG$28='RRIF French'!A6,Entrée!$AV$44,0)+F5","v":{"v":518512.85833318403,"d":"518,513"}},{"v":28673.761065825078,"d":"28,674"},{"$f":"+(C6-D6)*Entrée!$BB$44","v":0},{"$f":"+C6-D6","v":{"v":489839.097267359,"d":"489,839"}}]
[74,0.0567,{"$f":"+IF(Entrée!$AG$28='RRIF French'!A7,Entrée!$AV$44,0)+F6","v":{"v":489839.097267359,"d":"489,839"}},{"v":27773.876815059255,"d":"27,774"},{"$f":"+(C7-D7)*Entrée!$BB$44","v":0},{"v":462065.2204522997,"d":"462,065"}]
[75,0.0582,{"$f":"+IF(Entrée!$AG$28='RRIF French'!A8,Entrée!$AV$44,0)+F7","v":{"v":462065.2204522997,"d":"462,065"}},{"v":26892.195830323843,"d":"26,892"},{"$f":"+(C8-D8)*Entrée!$BB$44","v":0},{"v":435173.02462197584,"d":"435,173"}]
{"$rows_left_out":36}
{"sheet":"Estate tax rates","index":14,"n_rows":69,"n_cols":10,"rows_kept":69,"hidden":true,"merged":[[0,1,0,2],[0,4,0,5]]}
[null,"Range",null,null,"Rate",null,null,"Probate fees",null,{"$f":"(Input!$BP$79-Input!$BP$101)","v":{"v":2409025.933149502,"d":"2,409,026 "}}]
["AB",0,{"v":10000,"d":"10,000.00"},null,{"v":35,"d":"35.00"},null,null,{"$f":"+IF(AND($J$1>B2,$J$1<B3),E2,0)","v":0},null,"https://www.alberta.ca/court-fees.aspx"]
[null,{"$f":"+C2+0.01","v":{"v":10000.01,"d":"10,000.01"}},{"v":25000,"d":"25,000.00"},null,{"v":135,"d":"135.00"},null,null,{"$f":"+IF(AND($J$1>C2,$J$1<B4),E3,0)","v":0}]
[null,{"$f":"+C3+0.01","v":{"v":25000.01,"d":"25,000.01"}},{"v":125000,"d":"125,000.00"},null,{"v":275,"d":"275.00"},null,null,{"$f":"+IF(AND($J$1>C3,$J$1<B5),E4,0)","v":0}]
[null,{"$f":"+C4+0.01","v":{"v":125000.01,"d":"125,000.01"}},{"v":250000,"d":"250,000.00"},null,{"v":400,"d":"400.00"},null,null,{"$f":"+IF(AND(J1>C4,J1<B6),E5,0)","v":0}]
[null,{"$f":"+C5+0.01","v":{"v":250000.01,"d":"250,000.01"}},null,null,{"v":525,"d":"525.00"},null,null,{"$f":"+IF(J1>C5,E6,0)","v":{"v":525,"d":"525.00"}}]
[{"$nulls":7},{"$f":"SUM(H2:H6)","v":{"v":525,"d":"525.00"}}]
[]
{"$rows_left_out":62}
{"sheet":"Estate tax rates French","index":15,"n_rows":69,"n_cols":10,"rows_kept":69,"hidden":true,"merged":[[0,1,0,2],[0,4,0,5]]}
[null,"Range",null,null,"Rate",null,null,"Probate fees",null,{"$f":"(Entrée!$BT$79-Entrée!$BT$101)","v":{"v":2409025.933149502,"d":"2,409,026 "}}]
["AB",0,{"v":10000,"d":"10,000.00"},null,{"v":35,"d":"35.00"},null,null,{"$f":"+IF(AND($J$1>B2,$J$1<B3),E2,0)","v":0},null,"https://www.alberta.ca/court-fees.aspx"]
[null,{"$f":"+C2+0.01","v":{"v":10000.01,"d":"10,000.01"}},{"v":25000,"d":"25,000.00"},null,{"v":135,"d":"135.00"},null,null,{"$f":"+IF(AND($J$1>C2,$J$1<B4),E3,0)","v":0}]
[null,{"$f":"+C3+0.01","v":{"v":25000.01,"d":"25,000.01"}},{"v":125000,"d":"125,000.00"},null,{"v":275,"d":"275.00"},null,null,{"$f":"+IF(AND($J$1>C3,$J$1<B5),E4,0)","v":0}]
[null,{"$f":"+C4+0.01","v":{"v":125000.01,"d":"125,000.01"}},{"v":250000,"d":"250,000.00"},null,{"v":400,"d":"400.00"},null,null,{"$f":"+IF(AND(J1>C4,J1<B6),E5,0)","v":0}]
[null,{"$f":"+C5+0.01","v":{"v":250000.01,"d":"250,000.01"}},null,null,{"v":525,"d":"525.00"},null,null,{"$f":"+IF(J1>C5,E6,0)","v":{"v":525,"d":"525.00"}}]
[{"$nulls":7},{"$f":"SUM(H2:H6)","v":{"v":525,"d":"525.00"}}]
[]
{"$rows_left_out":61}