{"text_format":"3","workbook":"xlsx","n_sheets":16,"sheets":["Output","Input","Considerations","Sortie","Entrée","Considérations","Raw Data","Notes","List","List French","LTCGE","LTCGE French","RRIF","RRIF French","Estate tax rates","Estate tax rates French"],"not_rendered":{"charts":2,"images":12,"macros":1,"defined_names":248,"comments":2},"read":"whole","date_system":"1900"}

{"sheet":"Output","index":0,"n_rows":30,"n_cols":17,"rows_kept":30,"hidden":true,"merged":[[11,1,11,16],[15,1,15,16],[16,3,16,6],[17,3,18,6],[17,10,18,15],[19,10,20,15],[21,3,21,6],[21,10,22,15],[22,3,23,6],[27,1,27,16],[28,1,28,16],[29,1,29,16]]}
{"$rows_empty":9}
[{"$nulls":16},"v2025.02"]
[]
[null,"You’ve worked your whole life to build your wealth and would like your loved ones to continue enjoying the fruits of your hard work. However, there are taxes and expenses that must be paid in cash before your assets are transferred to your beneficiaries. Those taxes and expenses may be higher than you think and may significantly reduce the size of your estate available to your beneficiaries. Further, if your estate does not have enough liquid assets to pay off those expenses some of the other assets may have to be quickly sold for example: your home, cottage or vehicles."]
[null,"The following chart is an estimation of what could happen to your estate and the cash shortfall you will leave behind."]
[]
[]
[null,"Taxes and final expenses may shrink the estate you intend to leave behind for your beneficiary."]
[{"$nulls":3},"You intend to leave this for your beneficiary:"]
[{"$nulls":3},{"$f":"'Raw Data'!D22","v":{"v":0,"d":"$0.0 M"}},{"$nulls":6},"Expected reduction in estate due to liabilities, expenses and taxes:"]
{"$rows_left_out":13}
{"sheet":"Input","index":1,"n_rows":148,"n_cols":80,"rows_kept":148,"hidden":true,"merged":[[4,16,4,59],[7,7,7,29],[8,11,8,12],[10,26,10,60],[15,2,15,84],[16,2,16,84],[17,2,17,84],[18,2,18,84],[19,2,19,84],[24,2,24,84],[25,2,25,84],[26,2,26,84],[28,3,28,7],[28,8,28,26],[28,35,28,36],[28,46,28,47],[28,62,28,63],[28,78,28,82],[34,2,34,84],[35,2,35,84],[36,2,36,84],[38,25,38,30],[38,32,38,36],[38,38,38,42],[38,44,38,48],[38,50,38,54],[38,56,38,59],[38,61,38,65],[38,67,38,71],[38,73,38,77],[38,79,38,83],[40,61,40,65],[40,79,40,83],[42,3,42,6],[42,27,42,28],[42,38,42,42],[42,44,42,48],[42,50,42,54],[42,56,42,59],[42,61,42,65],[42,73,42,77],[42,79,42,83],[44,3,44,6],[44,27,44,28],[44,50,44,54],[44,56,44,59],[44,61,44,65],[44,73,44,77],[44,79,44,83],[46,27,46,28],[46,38,46,42],[46,44,46,48],[46,50,46,54],[46,56,46,59],[46,61,46,65],[46,79,46,83],[48,3,48,26],[48,27,48,28],[48,32,48,36],[48,38,48,42],[48,44,48,48],[48,50,48,54],[48,56,48,59],[48,61,48,65],[48,67,48,71],[48,79,48,83],[50,3,50,26],[50,27,50,28],[50,32,50,36],[50,38,50,42],[50,44,50,48],[50,50,50,54],[50,56,50,59],[50,61,50,65],[50,67,50,71],[50,79,50,83],[52,27,52,28],[52,32,52,36],[52,38,52,42],[52,44,52,48],[52,50,52,54],[52,56,52,59],[52,61,52,65],[52,67,52,71],[52,79,52,83],[54,32,54,36],[54,50,54,54],[54,56,54,59],[54,61,54,65],[54,67,54,71],[54,79,54,83],[56,32,56,36],[56,50,56,54],[56,56,56,59],[56,61,56,65],[56,67,56,71],[56,79,56,83],[58,32,58,36],[58,50,58,54],[58,56,58,59],[58,61,58,65],[58,67,58,71],[58,79,58,83],[60,27,60,28],[60,32,60,36],[60,50,60,54],[60,56,60,59],[60,61,60,65],[60,67,60,71],[60,79,60,83],[62,27,62,28],[62,32,62,36],[62,50,62,54],[62,61,62,65],[62,67,62,71],[62,79,62,83],[64,32,64,36],[64,38,64,42],[64,44,64,48],[64,50,64,54],[64,56,64,59],[64,61,64,65],[64,67,64,71],[64,79,64,83],[66,32,66,36],[66,38,66,42],[66,44,66,48],[66,50,66,54],[66,56,66,59],[66,61,66,65],[66,67,66,71],[66,79,66,83],[68,32,68,36],[68,38,68,42],[68,44,68,48],[68,50,68,54],[68,56,68,59],[68,61,68,65],[68,67,68,71],[68,79,68,83],[70,73,70,77],[72,73,72,77],[74,61,74,65],[74,73,74,77],[74,79,74,83],[76,61,76,65],[76,73,76,77],[76,79,76,83],[79,61,79,66],[79,67,79,71],[79,73,79,77],[79,79,79,83],[82,26,82,60],[88,2,88,84],[89,2,89,84],[90,2,90,84],[92,79,92,83],[94,32,94,36],[94,67,94,71],[96,32,97,36],[96,38,97,50],[96,51,97,55],[96,67,97,71],[99,32,99,36],[99,39,99,50],[99,51,99,55],[99,67,99,71],[101,73,101,77],[104,61,104,66],[104,67,104,71],[104,73,104,77],[104,79,104,83],[110,2,110,84],[111,2,111,84],[112,2,112,84],[114,3,114,9],[114,10,114,15],[114,17,114,27],[114,28,114,33],[114,35,114,50],[114,51,114,56],[114,62,114,77],[114,78,114,83],[120,2,120,25],[121,2,121,25],[122,2,122,25],[124,15,124,18],[124,20,124,24],[126,20,126,24],[128,20,128,24],[130,15,130,18],[130,20,130,24],[132,15,132,18],[132,20,132,24],[134,15,134,18],[134,20,134,24],[136,20,136,24],[138,20,138,24],[140,20,140,24],[143,3,143,19],[143,20,143,24],[147,2,147,84]]}
[]
[]
[]
[]
[{"$nulls":16},"Do not send this spreadsheet to your clients. Only the pdf printouts can be distributed."]
[]
[]
[null,null,"Prepared by:"]
[null,null,"Include in printouts:",{"$nulls":8},"No"]
[]
{"$rows_left_out":139}
{"sheet":"Considerations","index":2,"n_rows":47,"n_cols":4,"rows_kept":47,"hidden":true,"merged":[[14,2,14,76],[15,2,15,76],[16,2,16,76],[18,3,18,76],[19,3,19,76],[20,3,20,76],[21,3,21,76],[22,3,22,76],[23,3,23,76],[24,3,24,76],[30,2,30,76],[31,2,31,76],[32,2,32,76],[34,3,34,76],[35,3,35,76],[36,3,36,76],[37,3,37,76],[38,3,38,76],[39,3,39,76],[40,3,40,76],[41,3,41,76],[42,3,42,76],[43,3,43,76],[44,3,44,76],[45,3,45,76],[46,3,46,76]]}
{"$rows_empty":15}
[null,null,"General considerations"]
[]
[]
[null,null,1,"RBC Life Insurance Company recommends consulting with your legal, accounting, tax and financial advisors before making any decision. The information provided in this presentation is not intended to be relied upon as tax, legal, accounting or financial advice."]
[null,null,2,"RBC Life Insurance Company does not accept any liability for any direct, indirect or consequential loss arising from, or in connection with, the information in this presentation."]
[null,null,3,"Reasonable care has been taken to ensure the accuracy of the calculations and information provided, but errors and omissions are possible."]
[null,null,4,"If an insurance policy is issued, the coverage will be governed by the terms of the policy. This presentation will not form part of any policy issued."]
[null,null,5,"Buying a life insurance policy is a long-term commitment. Surrendering the policy can have significant tax and financial consequences."]
[null,null,6,"This is not an insurance illustration."]
{"$rows_left_out":24}
{"sheet":"Sortie","index":3,"n_rows":29,"n_cols":17,"rows_kept":29,"merged":[[11,1,11,16],[15,1,15,16],[16,3,16,6],[17,3,18,6],[17,10,18,15],[19,10,20,15],[21,3,21,6],[21,10,22,15],[22,3,23,6],[26,1,26,16],[27,1,27,16],[28,1,28,16]]}
[]
[]
[]
[null,"Quel patrimoine laissez-vous réellement ?"]
[]
[]
[]
[]
[]
[{"$nulls":16},"v2025.02"]
{"$rows_left_out":20}
{"sheet":"Entrée","index":4,"n_rows":146,"n_cols":84,"rows_kept":146,"merged":[[4,9,4,61],[7,7,7,29],[8,15,8,16],[10,26,10,64],[15,2,15,88],[16,2,16,88],[17,2,17,88],[18,2,18,88],[19,2,19,88],[24,2,24,88],[25,2,25,88],[26,2,26,88],[28,8,28,24],[28,36,28,37],[28,51,28,52],[28,66,28,67],[28,82,28,86],[34,2,34,88],[35,2,35,88],[36,2,36,88],[38,28,38,33],[38,35,38,39],[38,41,38,45],[38,47,38,51],[38,53,38,57],[38,59,38,63],[38,65,38,69],[38,71,38,75],[38,77,38,81],[38,83,38,87],[40,65,40,69],[40,83,40,87],[42,3,42,6],[42,30,42,31],[42,41,42,45],[42,47,42,51],[42,53,42,57],[42,59,42,63],[42,65,42,69],[42,77,42,81],[42,83,42,87],[44,3,44,6],[44,30,44,31],[44,53,44,57],[44,59,44,63],[44,65,44,69],[44,77,44,81],[44,83,44,87],[46,30,46,31],[46,41,46,45],[46,47,46,51],[46,53,46,57],[46,59,46,63],[46,65,46,69],[46,83,46,87],[48,3,48,29],[48,30,48,31],[48,35,48,39],[48,41,48,45],[48,47,48,51],[48,53,48,57],[48,59,48,63],[48,65,48,69],[48,71,48,75],[48,83,48,87],[50,3,50,29],[50,30,50,31],[50,35,50,39],[50,41,50,45],[50,47,50,51],[50,53,50,57],[50,59,50,63],[50,65,50,69],[50,71,50,75],[50,83,50,87],[52,30,52,31],[52,35,52,39],[52,41,52,45],[52,47,52,51],[52,53,52,57],[52,59,52,63],[52,65,52,69],[52,71,52,75],[52,83,52,87],[54,35,54,39],[54,53,54,57],[54,59,54,63],[54,65,54,69],[54,71,54,75],[54,83,54,87],[56,35,56,39],[56,53,56,57],[56,59,56,63],[56,65,56,69],[56,71,56,75],[56,83,56,87],[58,3,59,34],[58,35,58,39],[58,53,58,57],[58,59,58,63],[58,65,58,69],[58,71,58,75],[58,83,58,87],[60,30,60,31],[60,35,60,39],[60,53,60,57],[60,59,60,63],[60,65,60,69],[60,71,60,75],[60,83,60,87],[62,30,62,31],[62,35,62,39],[62,53,62,57],[62,65,62,69],[62,71,62,75],[62,83,62,87],[64,3,65,34],[64,35,64,39],[64,41,64,45],[64,47,64,51],[64,53,64,57],[64,59,64,63],[64,65,64,69],[64,71,64,75],[64,83,64,87],[66,35,66,39],[66,41,66,45],[66,47,66,51],[66,53,66,57],[66,59,66,63],[66,65,66,69],[66,71,66,75],[66,83,66,87],[68,35,68,39],[68,41,68,45],[68,47,68,51],[68,53,68,57],[68,59,68,63],[68,65,68,69],[68,71,68,75],[68,83,68,87],[70,77,70,81],[72,77,72,81],[74,65,74,69],[74,77,74,81],[74,83,74,87],[76,65,76,69],[76,77,76,81],[76,83,76,87],[79,65,79,70],[79,71,79,75],[79,77,79,81],[79,83,79,87],[83,26,83,64],[88,2,88,88],[89,2,89,88],[90,2,90,88],[92,83,92,87],[94,40,94,44],[94,71,94,75],[96,40,97,44],[96,46,97,63],[96,64,97,68],[96,71,97,75],[99,40,99,44],[99,46,99,63],[99,64,99,68],[99,71,99,75],[102,65,102,70],[102,71,102,75],[102,77,102,81],[102,83,102,87],[108,2,108,88],[109,2,109,88],[110,2,110,88],[112,3,112,9],[112,10,112,15],[112,17,112,34],[112,35,112,40],[112,42,112,59],[112,60,112,65],[112,67,112,81],[112,82,112,87],[118,2,118,28],[119,2,119,28],[120,2,120,28],[122,15,123,18],[122,20,122,27],[124,20,124,27],[126,20,126,27],[128,15,128,18],[128,20,128,27],[130,15,130,18],[130,20,130,27],[132,15,132,18],[132,20,132,27],[134,20,134,27],[136,20,136,27],[138,20,138,27],[141,3,141,19],[141,20,141,27],[145,2,145,88]]}
[]
[]
[]
[]
[{"$nulls":9},"N’envoyez pas ce tableur à vos clients. Seuls les documents imprimés en format PDF peuvent être distribués."]
[]
[]
[null,null,"Préparé par:"]
[null,null," Inclure dans les impressions:",{"$nulls":12},"Non"]
[]
{"$rows_left_out":137}
{"sheet":"Considérations","index":5,"n_rows":47,"n_cols":4,"rows_kept":47,"merged":[[14,2,14,76],[15,2,15,76],[16,2,16,76],[18,3,18,76],[19,3,19,76],[20,3,20,76],[21,3,21,76],[22,3,22,76],[23,3,23,76],[24,3,24,76],[30,2,30,76],[31,2,31,76],[32,2,32,76],[34,3,34,76],[35,3,35,76],[36,3,36,76],[37,3,37,76],[38,3,38,76],[39,3,39,76],[40,3,40,76],[41,3,41,76],[42,3,42,76],[43,3,43,76],[44,3,44,76],[45,3,45,76],[46,3,46,76]]}
{"$rows_empty":15}
[null,null,"Considérations d’ordre général"]
[]
[]
[null,null,1,"La Compagnie d’assurance vie RBC recommande de consulter vos conseillers juridiques, comptables, fiscaux et financiers avant de prendre une décision. Les renseignements contenus dans cette présentation ne devraient pas être interprétés comme des conseils d’ordre fiscal, juridique, comptable ou financier."]
[null,null,2,"La Compagnie d’assurance vie RBC n’accepte aucune responsabilité pour toute perte directe, indirecte ou consécutive découlant des renseignements dans cette présentation."]
[null,null,3,"Des précautions raisonnables ont été prises pour garantir l’exactitude des calculs et des renseignements fournis, mais des erreurs et des omissions sont possibles."]
[null,null,4,"Si une police d’assurance est établie, la couverture sera régie par les conditions de la police. Cette présentation ne fait pas partie d’une police établie."]
[null,null,5,"La souscription d’une police d’assurance vie est un engagement à long terme. Le rachat de la police peut avoir d’importantes répercussions fiscales et financières."]
[null,null,6,"Il ne s’agit pas d’un exposé d’assurance."]
{"$rows_left_out":24}
{"sheet":"Raw Data","index":6,"n_rows":39,"n_cols":9,"rows_kept":39,"hidden":true}
[]
[null,"French"]
[{"$nulls":6},"M"]
[null,"Your beneficiary likely gets",{"$f":"C19","v":{"v":0,"d":"$0.0 M"}},null,null,"Liquid",{"$f":"Input!K115","v":{"v":0,"d":"0 "}},{"$f":"G4","v":{"v":0,"d":"$0.0 M"}},{"$f":"IF($B$2=\"French\",SUBSTITUTE(TEXT(H4/100000,\"# ##0.0\"),\".\",\",\")&\" M$\",H4)","v":"0,0 M$"}]
[null,"Your estate pays in taxes etc.",{"$f":"C20","v":{"v":0,"d":"$0.0 M"}},null,null,"Non-Liquid",{"$f":"C7-G4","v":0},{"$f":"G5","v":{"v":0,"d":"$0.0 M"}},{"$f":"IF($B$2=\"French\",SUBSTITUTE(TEXT(H5/100000,\"# ##0.0\"),\".\",\",\")&\" M$\",H5)","v":"0,0 M$"}]
[]
[null,null,{"$f":"Input!$CB$80","v":0}]
[]
[]
[null,"Votre bénéficiaire reçoit",{"$f":"C4","v":{"v":0,"d":"$0.0 M"}},{"$f":"IF($B$2=\"French\",SUBSTITUTE(TEXT(C10/100000,\"# ##0.0\"),\".\",\",\")&\" M$\",C10)","v":"0,0 M$"}]
{"$rows_left_out":24}
{"sheet":"Notes","index":7,"n_rows":44,"n_cols":2,"rows_kept":44,"hidden":true}
[]
["Nehal"]
["Done","1. The text in the “about this calculator should be changed as under:"]
[null,"The purpose of this calculator is to estimate the income tax and estate tax that may become payable upon your death based on the assets you may own at that time and show its impact on your estate. The calculation assumes that you are either single or last to die spouse/common law-partner."]
["Done","2. The width of client information section should be expanded to match the size of other sections. May be client name, age and comparison age would appear in one row, and the province and marginal tax rate would appear in next row."]
[null,"3. If possible design the calculator such that if the client’s current age is 72 or higher, the RRSP row does not appear."]
["Will see what I can do during the coding part of this calculator. Might be able to hide the RRSP row altogether when the age is high enough."]
["Done","4. The formulas in “data entry” tab of the excel file Is end may be directly included in this input tab. The we will not need data entry tab."]
["It will","5. The column width needs to be adjusted so that all content fit in either portrait or landscape orientation."]
["It will","6. Also the $ amount cell should adjust auto-adjust the width based on the value entered/calculated. The value will be without decimals (except for %)."]
{"$rows_left_out":35}
{"sheet":"List","index":8,"n_rows":72,"n_cols":4,"rows_kept":72,"hidden":true}
["Capital gains inclusion factor",{"v":0.5,"d":"50.00%"}]
[]
["Province","Estate tax"]
[]
["AB",{"$f":"+'Estate tax rates'!H7","v":0},"Alberta",{"$f":"B5","v":0}]
["BC",{"$f":"+'Estate tax rates'!H12","v":0},"British Columbia",{"$f":"B6","v":0}]
["MB",{"$f":"+'Estate tax rates'!H15","v":0},"Manitoba",0]
["NB",{"$f":"+'Estate tax rates'!H22","v":0},"New Brunswick",0]
["NL",{"$f":"+'Estate tax rates'!H26","v":0},"Newfoundland & Labrador",0]
["NT",{"$f":"+'Estate tax rates'!H33","v":0},"Northwest Territories",0]
{"$rows_left_out":63}
{"sheet":"List French","index":9,"n_rows":72,"n_cols":4,"rows_kept":72,"hidden":true}
["Capital gains inclusion factor",{"v":0.5,"d":"50.00%"}]
[]
["Province","Estate tax"]
[]
["AB",{"$f":"+'Estate tax rates French'!H7","v":0},"Alberta",{"$f":"B5","v":0}]
["BC",{"$f":"+'Estate tax rates French'!H12","v":0},"British Columbia",{"$f":"B6","v":0}]
["MB",{"$f":"+'Estate tax rates French'!H15","v":0},"Manitoba",0]
["NB",{"$f":"+'Estate tax rates French'!H22","v":0},"New Brunswick",0]
["NL",{"$f":"+'Estate tax rates French'!H26","v":0},"Newfoundland & Labrador",0]
["NT",{"$f":"+'Estate tax rates French'!H33","v":0},"Northwest Territories",0]
{"$rows_left_out":63}
{"sheet":"LTCGE","index":10,"n_rows":101,"n_cols":12,"rows_kept":101,"hidden":true}
["Year","Age","LTCGE limit","LTCGD limit",null,"Canada Entrepreneurs Incentive",{"$nulls":3},"Inflation factor",{"v":0.03,"d":"3%"},{"$f":"SUBSTITUTE(TEXT(K1*10,\"0.0%\"),\".\",\",\")","v":"3,0%"}]
[{"$f":"YEAR(NOW())","v":2025},{"$f":"Input!$AJ$29","v":0},{"v":1250000,"d":"1,250,000.00"},{"$f":"+C2*1/2*100%","v":{"v":625000,"d":"625,000.00"}},null,{"v":400000,"d":"400,000.00"}]
[{"$f":"+A2+1","v":2026},{"$f":"+B2+1","v":1},{"v":1250000,"d":"1,250,000.00"},{"$f":"+C3*1/2*100%","v":{"v":625000,"d":"625,000.00"}},null,{"$f":"F2+400000","v":{"v":800000,"d":"800,000.00"}},{"$nulls":3},"CEI inclusion rate",0.3333333333333333]
[{"$f":"+A3+1","v":2027},{"$f":"+B3+1","v":2},{"$f":"IF(ISNA(VLOOKUP(A4,$L$3:$M$4,2,FALSE)),C3*(1+$K$1),VLOOKUP(A4,$L$3:$M$4,2,FALSE))","v":{"v":1287500,"d":"1,287,500.00"}},{"v":643750,"d":"643,750.00"},null,{"$f":"F3+400000","v":{"v":1200000,"d":"1,200,000.00"}}]
[2028,3,{"v":1326125,"d":"1,326,125.00"},{"v":663062.5,"d":"663,062.50"},null,{"$f":"F4+400000","v":{"v":1600000,"d":"1,600,000.00"}}]
[2029,4,{"v":1365908.75,"d":"1,365,908.75"},{"v":682954.375,"d":"682,954.38"},null,{"$f":"F5+400000","v":{"v":2000000,"d":"2,000,000.00"}}]
[2030,5,{"v":1406886.0125,"d":"1,406,886.01"},{"v":703443.00625,"d":"703,443.01"},null,{"$f":"F6","v":{"v":2000000,"d":"2,000,000.00"}}]
[2031,6,{"v":1449092.592875,"d":"1,449,092.59"},{"v":724546.2964375,"d":"724,546.30"},null,{"$f":"F7","v":{"v":2000000,"d":"2,000,000.00"}}]
[2032,7,{"v":1492565.37066125,"d":"1,492,565.37"},{"v":746282.685330625,"d":"746,282.69"},null,{"v":2000000,"d":"2,000,000.00"}]
[2033,8,{"v":1537342.3317810877,"d":"1,537,342.33"},{"v":768671.1658905438,"d":"768,671.17"},null,{"v":2000000,"d":"2,000,000.00"}]
{"$rows_left_out":92}
{"sheet":"LTCGE French","index":11,"n_rows":101,"n_cols":12,"rows_kept":101,"hidden":true}
["Year","Age","LTCGE limit","LTCGD limit",null,"Canada Entrepreneurs Incentive",{"$nulls":4},"Inflation factor",{"$f":"LTCGE!K1","v":{"v":0.03,"d":"3%"}}]
[{"$f":"YEAR(NOW())","v":2025},{"$f":"Entrée!$AK$29","v":0},{"v":1250000,"d":"1,250,000.00"},{"$f":"+C2*1/2*100%","v":{"v":625000,"d":"625,000.00"}},null,{"v":400000,"d":"400,000.00"}]
[{"$f":"+A2+1","v":2026},{"$f":"+B2+1","v":1},{"v":1250000,"d":"1,250,000.00"},{"$f":"+C3*1/2*100%","v":{"v":625000,"d":"625,000.00"}},null,{"$f":"F2+400000","v":{"v":800000,"d":"800,000.00"}},{"$nulls":4},"CEI inclusion rate",0.3333333333333333]
[{"$f":"+A3+1","v":2027},2,{"$f":"IF(ISNA(VLOOKUP(A4,LTCGE!$L$3:$M$4,2,FALSE)),C3*(1+$L$1),VLOOKUP(A4,LTCGE!$L$3:$M$4,2,FALSE))","v":{"v":1287500,"d":"1,287,500.00"}},{"v":643750,"d":"643,750.00"},null,{"$f":"F3+400000","v":{"v":1200000,"d":"1,200,000.00"}}]
[2028,3,{"$f":"IF(ISNA(VLOOKUP(A5,LTCGE!$L$3:$M$4,2,FALSE)),C4*(1+$L$1),VLOOKUP(A5,LTCGE!$L$3:$M$4,2,FALSE))","v":{"v":1326125,"d":"1,326,125.00"}},{"v":663062.5,"d":"663,062.50"},null,{"$f":"F4+400000","v":{"v":1600000,"d":"1,600,000.00"}}]
[2029,4,{"$f":"IF(ISNA(VLOOKUP(A6,LTCGE!$L$3:$M$4,2,FALSE)),C5*(1+$L$1),VLOOKUP(A6,LTCGE!$L$3:$M$4,2,FALSE))","v":{"v":1365908.75,"d":"1,365,908.75"}},{"v":682954.375,"d":"682,954.38"},null,{"$f":"F5+400000","v":{"v":2000000,"d":"2,000,000.00"}}]
[2030,5,{"$f":"IF(ISNA(VLOOKUP(A7,LTCGE!$L$3:$M$4,2,FALSE)),C6*(1+$L$1),VLOOKUP(A7,LTCGE!$L$3:$M$4,2,FALSE))","v":{"v":1406886.0125,"d":"1,406,886.01"}},{"v":703443.00625,"d":"703,443.01"},null,{"$f":"F6","v":{"v":2000000,"d":"2,000,000.00"}}]
[2031,6,{"$f":"IF(ISNA(VLOOKUP(A8,LTCGE!$L$3:$M$4,2,FALSE)),C7*(1+$L$1),VLOOKUP(A8,LTCGE!$L$3:$M$4,2,FALSE))","v":{"v":1449092.592875,"d":"1,449,092.59"}},{"v":724546.2964375,"d":"724,546.30"},null,{"$f":"F7","v":{"v":2000000,"d":"2,000,000.00"}}]
[2032,7,{"$f":"IF(ISNA(VLOOKUP(A9,LTCGE!$L$3:$M$4,2,FALSE)),C8*(1+$L$1),VLOOKUP(A9,LTCGE!$L$3:$M$4,2,FALSE))","v":{"v":1492565.37066125,"d":"1,492,565.37"}},{"v":746282.685330625,"d":"746,282.69"},null,{"v":2000000,"d":"2,000,000.00"}]
[2033,8,{"$f":"IF(ISNA(VLOOKUP(A10,LTCGE!$L$3:$M$4,2,FALSE)),C9*(1+$L$1),VLOOKUP(A10,LTCGE!$L$3:$M$4,2,FALSE))","v":{"v":1537342.3317810877,"d":"1,537,342.33"}},{"v":768671.1658905438,"d":"768,671.17"},null,{"v":2000000,"d":"2,000,000.00"}]
{"$rows_left_out":92}
{"sheet":"RRIF","index":12,"n_rows":43,"n_cols":6,"rows_kept":43,"hidden":true}
[]
["Age on January 1st","RRIF factor","Value on January 1st","Minimum withdrawal","Annual growth","Cl.bal."]
[]
[71,0.0528,{"$f":"+IF(Eng_Client_Age<72,IF(AND(Eng_Cont_Yrs_RRSP>0,Eng_Cont_Yrs_RRSP<72-Eng_Client_Age),FV(Eng_Rate_RRSP,71-Eng_Client_Age-Eng_Cont_Yrs_RRSP,0,-FV(Eng_Rate_RRSP,Eng_Cont_Yrs_RRSP,-Eng_Cont_RRSP,-Eng_FMV_RRSP,1),1),FV(Eng_Rate_RRSP,71-Eng_Client_Age,-Eng_Cont_RRSP,-Eng_FMV_RRSP,1)),IF(A4=Eng_Client_Age,Eng_FMV_RRIF,0))","v":0},{"$f":"+C4*B4","v":0},{"$f":"+(C4-D4)*IF(Eng_Rate_RRIF>0,Eng_Rate_RRIF,Eng_Rate_RRSP)","v":0},{"$f":"+C4-D4+E4","v":0}]
[{"$f":"+A4+1","v":72},{"v":0.054,"d":"0.0540"},{"$f":"+IF(Eng_Client_Age=A5,Eng_FMV_RRIF,0)+F4","v":0},{"$f":"+C5*B5","v":0},0,{"$f":"+C5-D5+E5","v":0}]
[{"$f":"+A5+1","v":73},0.0553,0,0,0,{"$f":"+C6-D6","v":0}]
[74,0.0567,0,0,0,0]
[75,0.0582,0,0,0,0]
[76,0.0598,0,0,0,0]
[77,0.0617,0,0,0,0]
{"$rows_left_out":34}
{"sheet":"RRIF French","index":13,"n_rows":43,"n_cols":6,"rows_kept":43,"hidden":true}
[]
["Age on January 1st","RRIF factor","Value on January 1st","Minimum withdrawal","Annual growth","Cl.bal."]
[]
[71,0.0528,{"$f":"+IF(Fre_Client_Age<72,IF(AND(Fre_Cont_Yrs_RRSP>0,Fre_Cont_Yrs_RRSP<72-Fre_Client_Age),FV(Fre_Rate_RRSP,71-Fre_Client_Age-Fre_Cont_Yrs_RRSP,0,-FV(Fre_Rate_RRSP,Fre_Cont_Yrs_RRSP,-Fre_Cont_RRSP,-Fre_FMV_RRSP,1),1),FV(Fre_Rate_RRSP,71-Fre_Client_Age,-Fre_Cont_RRSP,-Fre_FMV_RRSP,1)),IF(A4=Fre_Client_Age,Fre_FMV_RRIF,0))","v":0},{"$f":"+C4*B4","v":0},{"$f":"+(C4-D4)*IF(Fre_Rate_RRIF>0,Fre_Rate_RRIF,Fre_Rate_RRSP)","v":0},{"$f":"+C4-D4+E4","v":0}]
[{"$f":"+A4+1","v":72},{"v":0.054,"d":"0.0540"},{"$f":"+IF(Fre_Client_Age=A5,Fre_FMV_RRIF,0)+F4","v":0},{"$f":"+C5*B5","v":0},0,{"$f":"+C5-D5+E5","v":0}]
[{"$f":"+A5+1","v":73},0.0553,0,0,0,{"$f":"+C6-D6","v":0}]
[74,0.0567,0,0,0,0]
[75,0.0582,0,0,0,0]
[76,0.0598,0,0,0,0]
[77,0.0617,0,0,0,0]
{"$rows_left_out":34}
{"sheet":"Estate tax rates","index":14,"n_rows":69,"n_cols":10,"rows_kept":69,"hidden":true,"merged":[[0,1,0,2],[0,4,0,5]]}
[null,"Range",null,null,"Rate",null,null,"Probate fees",null,{"$f":"(Input!$CB$80-Input!$CB$93)","v":{"v":0,"d":"0 "}}]
["AB",0,{"v":10000,"d":"10,000.00"},null,{"v":35,"d":"35.00"},null,null,{"$f":"+IF(AND($J$1>B2,$J$1<B3),E2,0)","v":0},null,"https://www.alberta.ca/court-fees.aspx"]
[null,{"$f":"+C2+0.01","v":{"v":10000.01,"d":"10,000.01"}},{"v":25000,"d":"25,000.00"},null,{"v":135,"d":"135.00"},null,null,{"$f":"+IF(AND($J$1>C2,$J$1<B4),E3,0)","v":0}]
[null,{"$f":"+C3+0.01","v":{"v":25000.01,"d":"25,000.01"}},{"v":125000,"d":"125,000.00"},null,{"v":275,"d":"275.00"},null,null,{"$f":"+IF(AND($J$1>C3,$J$1<B5),E4,0)","v":0}]
[null,{"$f":"+C4+0.01","v":{"v":125000.01,"d":"125,000.01"}},{"v":250000,"d":"250,000.00"},null,{"v":400,"d":"400.00"},null,null,{"$f":"+IF(AND(J1>C4,J1<B6),E5,0)","v":0}]
[null,{"$f":"+C5+0.01","v":{"v":250000.01,"d":"250,000.01"}},null,null,{"v":525,"d":"525.00"},null,null,{"$f":"+IF(J1>C5,E6,0)","v":0}]
[{"$nulls":7},{"$f":"SUM(H2:H6)","v":0}]
[]
["BC",0,{"v":25000,"d":"25,000.00"},null,0,null,null,{"$f":"+IF(AND(J1>B9,J1<B10),E9,0)","v":0},null,"https://www.bclaws.gov.bc.ca/civix/document/id/complete/statreg/00_99004_01#section2"]
[null,{"$f":"+C9+0.01","v":{"v":25000.01,"d":"25,000.01"}},{"v":50000,"d":"50,000.00"},null,{"v":6,"d":"6.00"},"per 1000 or part thereof + $200 filing fees",null,{"$f":"+IF(J1<'Estate tax rates'!B10,0,IF(AND(J1>C9,J1<B11),+(CEILING((J1-C9),1000)/1000*E10)+200,(C10-C9)/1000*E10))","v":0}]
{"$rows_left_out":60}
{"sheet":"Estate tax rates French","index":15,"n_rows":69,"n_cols":10,"rows_kept":69,"hidden":true,"merged":[[0,1,0,2],[0,4,0,5]]}
[null,"Range",null,null,"Rate",null,null,"Probate fees",null,{"$f":"(Entrée!$CF$80-Entrée!$CF$93)","v":{"v":0,"d":"0 "}}]
["AB",0,{"v":10000,"d":"10,000.00"},null,{"v":35,"d":"35.00"},null,null,{"$f":"+IF(AND($J$1>B2,$J$1<B3),E2,0)","v":0},null,"https://www.alberta.ca/court-fees.aspx"]
[null,{"$f":"+C2+0.01","v":{"v":10000.01,"d":"10,000.01"}},{"v":25000,"d":"25,000.00"},null,{"v":135,"d":"135.00"},null,null,{"$f":"+IF(AND($J$1>C2,$J$1<B4),E3,0)","v":0}]
[null,{"$f":"+C3+0.01","v":{"v":25000.01,"d":"25,000.01"}},{"v":125000,"d":"125,000.00"},null,{"v":275,"d":"275.00"},null,null,{"$f":"+IF(AND($J$1>C3,$J$1<B5),E4,0)","v":0}]
[null,{"$f":"+C4+0.01","v":{"v":125000.01,"d":"125,000.01"}},{"v":250000,"d":"250,000.00"},null,{"v":400,"d":"400.00"},null,null,{"$f":"+IF(AND(J1>C4,J1<B6),E5,0)","v":0}]
[null,{"$f":"+C5+0.01","v":{"v":250000.01,"d":"250,000.01"}},null,null,{"v":525,"d":"525.00"},null,null,{"$f":"+IF(J1>C5,E6,0)","v":0}]
[{"$nulls":7},{"$f":"SUM(H2:H6)","v":0}]
[]
["BC",0,{"v":25000,"d":"25,000.00"},null,0,null,null,{"$f":"+IF(AND(J1>B9,J1<B10),E9,0)","v":0},null,"https://www.bclaws.gov.bc.ca/civix/document/id/complete/statreg/00_99004_01#section2"]
[null,{"$f":"+C9+0.01","v":{"v":25000.01,"d":"25,000.01"}},{"v":50000,"d":"50,000.00"},null,{"v":6,"d":"6.00"},"per 1000 or part thereof + $200 filing fees",null,{"$f":"+IF(J1<'Estate tax rates French'!B10,0,IF(AND(J1>C9,J1<B11),+(CEILING((J1-C9),1000)/1000*E10)+200,(C10-C9)/1000*E10))","v":0}]
{"$rows_left_out":59}